{"text_format":"3","workbook":"xlsx","n_sheets":9,"sheets":["Introduction","User manual","Company data","Overview of export businesses","Exportmatrix","Vorlage","Neu1","New","Neu3"],"not_rendered":{"charts":1,"images":5,"macros":1,"external_links":1,"defined_names":23,"comments":7},"read":"whole","date_system":"1900"}

{"sheet":"Introduction","index":0,"n_rows":11,"n_cols":2,"rows_kept":11,"merged":[[5,1,5,2],[10,1,10,2]]}
[]
[]
[]
[null,"Introduction"]
[]
[null,"The X-Risk export risk check is the outcome of an applied research project backed by the Commission for Technology and Innovation (CTI). It was developed and programmed in cooperation with the following partners:"]
[]
[]
[]
[]
[null,"Limitations: The X-Risk export risk check is intended solely for the assessment of risks in export businesses, and covers only one part of the risks to which companies are confronted. The check refers to publicly available data for which the correctness cannot be guaranteed. Under certain circumstances, companies may need to gather additional and more specific information in order to properly assess their own risks in the export business."]

{"sheet":"User manual","index":1,"n_rows":13,"n_cols":3,"rows_kept":13,"merged":[[5,1,5,2],[12,1,12,2],[15,1,15,2]]}
[]
[]
[]
[null,"Using the tool"]
[]
[null,"The X-Risk export check risk is designed to assess the export business of a company with respect to opportunities and risks, to gain an overview of the risk exposure of the company, and to derive measures for risk control. The development of the export risk check is based on a survey of 28 internationally experienced Swiss companies. This reflects how they handle export risks and provides the opportunity to systematise the export risk management of the company.  The check is structured as follows:"]
[null,"1)","Inputting of corporate data: In order to evaluate the relative size of the export business and the associated risks, the total turnover of the company and its net equity must be entered in the 'Company Data' workbook."]
[null,"2)","Determination of export businesses: The company must decide on its own understanding of the term ‘export business’ (projects in foreign markets, foreign customers, foreign markets) and the aspects of the export business for which a risk analysis should be created (critical amount of turnover, geographic location of the market, possible safeguarding of customer payments, critical operating conditions of products). Export businesses that fulfil the defined conditions are entered in the 'Export Businesses' workbook."]
[null,"3)","Assessment of export business: An individual portfolio is created for each determined export business. In these portfolios, the businesses are assessed with respect to resulting opportunities and risks. The evaluation of opportunities proceeds on the basis of expected profit contributions from the business. The evaluation of risks proceeds via an appraisal of the damage potential and the probability of occurrence of various export risks. The risk assessment is supported by the inclusion of links that reference relevant sources of information."]
[null,"4)","Analysis of the Export Risk Matrix: The export businesses of the company are positioned in an export risk matrix on the basis of anticipated gains and losses. The size of the circles reflects their significance for the company, based on share of turnover. Their position indicates the ratio of expected gains and losses. If an export business is positioned in the lower right half of the matrix, it belongs to one of the attractive foreign commitments in which the opportunities are greater than the risks. If a business is positioned in the upper left corner of the matrix, the risks outweigh the related opportunities. The company undertakes an overall assessment of the risk exposure in the export business and decides which export businesses require risk control measures."]
[null,"5)","Monitoring of export risks: The possible measures for the monitoring of export risks comprise the prevention, relocation and reduction of the expected risks. The related measures are more fully described in the X-risk guidelines. These are intended to reduce export risks to an acceptable level for the company."]
[null,"6)","Observation of export risks: Risks that are identified in the determination of export businesses should be periodically reviewed as well as re-evaluated, if required. The company should continuously monitor the development of risk exposure, and at year-end document measures taken in the Annual Report. "]
[null,"These steps for export risk management are described in more detail in the accompanying guidelines. The guidelines also contain advice on the institutionalisation in the company of export risk management.  "]

{"sheet":"Company data","index":2,"n_rows":10,"n_cols":2,"rows_kept":10}
[]
[]
[]
[null,"Company data"]
[]
[null,"\nCompany name"]
[]
[null,"\nRevenue (in CHF)"]
[]
[null,"\nEquity (in CHF)"]

{"sheet":"Overview of export businesses","index":3,"n_rows":27,"n_cols":9,"rows_kept":27,"merged":[[1,3,3,4],[1,5,3,5]]}
[]
[{"$nulls":3},"Input new export business"]
[]
[null,"Overview of export businesses"]
[]
[null,"Name","Designation","Product","Client","Country","Expected export revenue (in CHF)","Total expected gains (in CHF)","Total expected losses (in CHF)"]
[null,{"$f":"IF(ROW(J7)>COUNTA(x),\"\",IF(INDIRECT(\"'\"&INDEX(x,ROW(J7))&\"'!C6\")<>\"\",INDIRECT(\"'\"&INDEX(x,ROW(J7))&\"'!C6\"),\"\"))","v":""},{"$f":"IF(ROW(K7)>COUNTA(x),\"\",IF(INDIRECT(\"'\"&INDEX(x,ROW(K7))&\"'!C7\")<>\"\",INDIRECT(\"'\"&INDEX(x,ROW(K7))&\"'!C7\"),\"\"))","v":""},{"$f":"IF(ROW(L7)>COUNTA(x),\"\",IF(INDIRECT(\"'\"&INDEX(x,ROW(L7))&\"'!C8\")<>\"\",INDIRECT(\"'\"&INDEX(x,ROW(L7))&\"'!C8\"),\"\"))","v":""},{"$f":"IF(ROW(L7)>COUNTA(x),\"\",IF(INDIRECT(\"'\"&INDEX(x,ROW(L7))&\"'!C9\")<>\"\",INDIRECT(\"'\"&INDEX(x,ROW(L7))&\"'!C9\"),\"\"))","v":""},{"$f":"IF(ROW(L7)>COUNTA(x),\"\",IF(INDIRECT(\"'\"&INDEX(x,ROW(L7))&\"'!C10\")<>\"\",INDIRECT(\"'\"&INDEX(x,ROW(L7))&\"'!C10\"),\"\"))","v":""},{"$f":"IF(ROW(L7)>COUNTA(x),\"\",IF(INDIRECT(\"'\"&INDEX(x,ROW(L7))&\"'!F6\")<>\"\",INDIRECT(\"'\"&INDEX(x,ROW(L7))&\"'!F6\"),\"\"))","v":""},{"$f":"IF(ROW(L7)>COUNTA(x),\"\",IF(INDIRECT(\"'\"&INDEX(x,ROW(L7))&\"'!F9\")<>\"\",INDIRECT(\"'\"&INDEX(x,ROW(L7))&\"'!F9\"),\"\"))","v":""},{"$f":"IF(ROW(L7)>COUNTA(x),\"\",IF(INDIRECT(\"'\"&INDEX(x,ROW(L7))&\"'!F10\")<>\"\",INDIRECT(\"'\"&INDEX(x,ROW(L7))&\"'!F10\"),\"\"))","v":""}]
[null,"","","","","","","",""]
[null,"","","","","","","",""]
[null,"","","","","","","",""]
[null,"","","","","","","",""]
[null,"","","","","","","",""]
[null,"","","","","","","",""]
[null,"","","","","","","",""]
[null,"","","","","","","",""]
[null,"","","","","","","",""]
[null,"","","","","","","",""]
[null,"","","","","","","",""]
[null,"","","","","","","",""]
[null,"","","","","","","",""]
{"$rows_left_out":8}
{"sheet":"Exportmatrix","index":4,"n_rows":31,"n_cols":20,"rows_kept":31,"merged":[[6,1,22,1]]}
[]
[]
[]
[null,"Export matrix"]
[]
[{"$nulls":9},"Name","Designation",{"$nulls":6},"Expected export revenue / Total revenue","Expected gains / Net equity = opportunities",""]
[null,"Expected losses in % of net equity",{"$nulls":7},{"$f":"'Overview of export businesses'!B7","v":""},{"$f":"'Overview of export businesses'!C7","v":""},{"$nulls":6},{"$f":"('Overview of export businesses'!G7/Unternehmensumsatz)*100","v":{"$error":"#VALUE!"}},{"$f":"'Overview of export businesses'!H7/Eigenkapital","v":{"$error":"#VALUE!"}},{"$f":"'Overview of export businesses'!I7/Eigenkapital","v":{"$error":"#VALUE!"}}]
[{"$nulls":9},{"$f":"'Overview of export businesses'!B8","v":""},{"$f":"'Overview of export businesses'!C8","v":""},{"$nulls":6},{"$f":"('Overview of export businesses'!G8/Unternehmensumsatz)*100","v":{"$error":"#VALUE!"}},{"$f":"'Overview of export businesses'!H8/Eigenkapital","v":{"$error":"#VALUE!"}},{"$f":"'Overview of export businesses'!I8/Eigenkapital","v":{"$error":"#VALUE!"}}]
[{"$nulls":9},{"$f":"'Overview of export businesses'!B9","v":""},{"$f":"'Overview of export businesses'!C9","v":""},{"$nulls":6},{"$f":"('Overview of export businesses'!G9/Unternehmensumsatz)*100","v":{"$error":"#VALUE!"}},{"$f":"'Overview of export businesses'!H9/Eigenkapital","v":{"$error":"#VALUE!"}},{"$f":"'Overview of export businesses'!I9/Eigenkapital","v":{"$error":"#VALUE!"}}]
[{"$nulls":9},{"$f":"'Overview of export businesses'!B10","v":""},{"$f":"'Overview of export businesses'!C10","v":""},{"$nulls":6},{"$f":"('Overview of export businesses'!G10/Unternehmensumsatz)*100","v":{"$error":"#VALUE!"}},{"$f":"'Overview of export businesses'!H10/Eigenkapital","v":{"$error":"#VALUE!"}},{"$f":"'Overview of export businesses'!I10/Eigenkapital","v":{"$error":"#VALUE!"}}]
[{"$nulls":9},{"$f":"'Overview of export businesses'!B11","v":""},{"$f":"'Overview of export businesses'!C11","v":""},{"$nulls":6},{"$f":"('Overview of export businesses'!G11/Unternehmensumsatz)*100","v":{"$error":"#VALUE!"}},{"$f":"'Overview of export businesses'!H11/Eigenkapital","v":{"$error":"#VALUE!"}},{"$f":"'Overview of export businesses'!I11/Eigenkapital","v":{"$error":"#VALUE!"}}]
[{"$nulls":9},{"$f":"'Overview of export businesses'!B12","v":""},{"$f":"'Overview of export businesses'!C12","v":""},{"$nulls":6},{"$f":"('Overview of export businesses'!G12/Unternehmensumsatz)*100","v":{"$error":"#VALUE!"}},{"$f":"'Overview of export businesses'!H12/Eigenkapital","v":{"$error":"#VALUE!"}},{"$f":"'Overview of export businesses'!I12/Eigenkapital","v":{"$error":"#VALUE!"}}]
[{"$nulls":9},{"$f":"'Overview of export businesses'!B13","v":""},{"$f":"'Overview of export businesses'!C13","v":""},{"$nulls":6},{"$f":"('Overview of export businesses'!G13/Unternehmensumsatz)*100","v":{"$error":"#VALUE!"}},{"$f":"'Overview of export businesses'!H13/Eigenkapital","v":{"$error":"#VALUE!"}},{"$f":"'Overview of export businesses'!I13/Eigenkapital","v":{"$error":"#VALUE!"}}]
[{"$nulls":9},{"$f":"'Overview of export businesses'!B14","v":""},{"$f":"'Overview of export businesses'!C14","v":""},{"$nulls":6},{"$f":"('Overview of export businesses'!G14/Unternehmensumsatz)*100","v":{"$error":"#VALUE!"}},{"$f":"'Overview of export businesses'!H14/Eigenkapital","v":{"$error":"#VALUE!"}},{"$f":"'Overview of export businesses'!I14/Eigenkapital","v":{"$error":"#VALUE!"}}]
[{"$nulls":9},{"$f":"'Overview of export businesses'!B15","v":""},{"$f":"'Overview of export businesses'!C15","v":""},{"$nulls":6},{"$f":"('Overview of export businesses'!G15/Unternehmensumsatz)*100","v":{"$error":"#VALUE!"}},{"$f":"'Overview of export businesses'!H15/Eigenkapital","v":{"$error":"#VALUE!"}},{"$f":"'Overview of export businesses'!I15/Eigenkapital","v":{"$error":"#VALUE!"}}]
[{"$nulls":9},{"$f":"'Overview of export businesses'!B16","v":""},{"$f":"'Overview of export businesses'!C16","v":""},{"$nulls":6},{"$f":"('Overview of export businesses'!G16/Unternehmensumsatz)*100","v":{"$error":"#VALUE!"}},{"$f":"'Overview of export businesses'!H16/Eigenkapital","v":{"$error":"#VALUE!"}},{"$f":"'Overview of export businesses'!I16/Eigenkapital","v":{"$error":"#VALUE!"}}]
[{"$nulls":9},{"$f":"'Overview of export businesses'!B17","v":""},{"$f":"'Overview of export businesses'!C17","v":""},{"$nulls":6},{"$f":"('Overview of export businesses'!G17/Unternehmensumsatz)*100","v":{"$error":"#VALUE!"}},{"$f":"'Overview of export businesses'!H17/Eigenkapital","v":{"$error":"#VALUE!"}},{"$f":"'Overview of export businesses'!I17/Eigenkapital","v":{"$error":"#VALUE!"}}]
[{"$nulls":9},{"$f":"'Overview of export businesses'!B18","v":""},{"$f":"'Overview of export businesses'!C18","v":""},{"$nulls":6},{"$f":"('Overview of export businesses'!G18/Unternehmensumsatz)*100","v":{"$error":"#VALUE!"}},{"$f":"'Overview of export businesses'!H18/Eigenkapital","v":{"$error":"#VALUE!"}},{"$f":"'Overview of export businesses'!I18/Eigenkapital","v":{"$error":"#VALUE!"}}]
[{"$nulls":9},{"$f":"'Overview of export businesses'!B19","v":""},{"$f":"'Overview of export businesses'!C19","v":""},{"$nulls":6},{"$f":"('Overview of export businesses'!G19/Unternehmensumsatz)*100","v":{"$error":"#VALUE!"}},{"$f":"'Overview of export businesses'!H19/Eigenkapital","v":{"$error":"#VALUE!"}},{"$f":"'Overview of export businesses'!I19/Eigenkapital","v":{"$error":"#VALUE!"}}]
[{"$nulls":9},{"$f":"'Overview of export businesses'!B20","v":""},{"$f":"'Overview of export businesses'!C20","v":""},{"$nulls":6},{"$f":"('Overview of export businesses'!G20/Unternehmensumsatz)*100","v":{"$error":"#VALUE!"}},{"$f":"'Overview of export businesses'!H20/Eigenkapital","v":{"$error":"#VALUE!"}},{"$f":"'Overview of export businesses'!I20/Eigenkapital","v":{"$error":"#VALUE!"}}]
{"$rows_left_out":12}
{"sheet":"Vorlage","index":5,"n_rows":74,"n_cols":8,"rows_kept":74,"hidden":true,"merged":[[5,5,5,6],[6,5,6,6],[7,5,7,6],[8,5,8,6],[9,5,9,6],[12,1,19,1],[20,1,23,1],[24,1,27,1],[28,1,30,1],[31,1,35,1],[36,1,40,1],[41,1,46,1],[47,1,49,1],[50,1,55,1],[56,1,65,1]]}
[]
[]
[]
[null,"Beurteilung Exportgeschäft"]
[]
[null,"Name",null,null,"Erwarteter Exportumsatz \n(in CHF)"]
[null,"Kurzbezeichung",null,null,"Erwarteter Deckungsbeitrag \n(in CHF)"]
[null,"Produkt",null,null,"Ausserordentliche Erträge/Kosten \n(+/- in CHF)"]
[null,"Kunde",null,null,"\nTotal erwartete Gewinne (in CHF)\n",{"$f":"SUM(F7:F8)","v":{"v":0,"d":"0.00"}}]
[null,"Land",null,null,"\nTotal erwartete Verluste (in CHF)\n",{"$f":"SUM(G13:G66)","v":{"v":0,"d":"0.00"}}]
[]
[null,"Risiko-Arten",null,"Quelle","Maximaler Verlust (in CHF)","Eintretens-wahrscheinlichkeit"," Erwarteter Verlust (in CHF)","Ws in %"]
[null,"Wirtschaftliche Risiken","Währungsverluste","www.eulerhermes-aktuell.de/de/laenderinformationen/laenderinformationen.html",0,"Unwahrscheinlich",{"$f":"E13*H13","v":0},{"$f":"IF(F13=Unwahrscheinlich,$C$69,(IF(F13=STEW,$C$70,IF(F13=TEW,$C$71,IF(F13=MEW,$C$72,IF(F13=HEW,$C$73,IF(F13=SHEW,$C$74)))))))","v":{"v":0,"d":"0%"}}]
[null,null,"Inflation","http://data.worldbank.org/indicator/NY.GDP.DEFL.KD.ZG",0,"Unwahrscheinlich",0,{"v":0,"d":"0%"}]
[null,null,"Rezession","http://data.worldbank.org/indicator/NY.GDP.MKTP.KD.ZG",0,"Unwahrscheinlich",0,{"v":0,"d":"0%"}]
[null,null,"Devisenknappheit",null,0,"Unwahrscheinlich",0,{"v":0,"d":"0%"}]
[null,null,"Behinderung Devisentransfer","www.heritage.org/index/heatmap",0,"Unwahrscheinlich",0,{"v":0,"d":"0%"}]
[null,null,"Blockierung Mehrwertsteuer",null,0,"Unwahrscheinlich",0,{"v":0,"d":"0%"}]
[null,null,"Steuererhöhungen","www.doingbusiness.org/data/exploretopics/paying-taxes",0,"Unwahrscheinlich",0,{"v":0,"d":"0%"}]
[null,null,"Zollerhöhungen","www.wto.org/english/res_e/statis_e/statis_bis_e.htm?solution=WTO&path=/Dashboards/MAPS&file=Tariff.wcdf&bookmarkState={%22impl%22:%22client%22,%22params%22:{%22langParam%22:%22en%22}}",0,"Unwahrscheinlich",0,{"v":0,"d":"0%"}]
{"$rows_left_out":55}
{"sheet":"Neu1","index":6,"n_rows":74,"n_cols":8,"rows_kept":74,"hidden":true,"merged":[[5,5,5,6],[6,5,6,6],[7,5,7,6],[8,5,8,6],[9,5,9,6],[12,1,19,1],[20,1,23,1],[24,1,27,1],[28,1,30,1],[31,1,35,1],[36,1,40,1],[41,1,46,1],[47,1,49,1],[50,1,55,1],[56,1,65,1]]}
[]
[]
[]
[null,"Beurteilung Exportgeschäft"]
[]
[null,"Name",null,null,"Erwarteter Exportumsatz \n(in CHF)"]
[null,"Kurzbezeichung",null,null,"Erwarteter Deckungsbeitrag \n(in CHF)"]
[null,"Produkt",null,null,"Ausserordentliche Erträge/Kosten \n(+/- in CHF)"]
[null,"Kunde",null,null,"\nTotal erwartete Gewinne (in CHF)\n",{"$f":"SUM(F7:F8)","v":{"v":0,"d":"0.00"}}]
[null,"Land",null,null,"\nTotal erwartete Verluste (in CHF)\n",{"$f":"SUM(G13:G66)","v":{"v":0,"d":"0.00"}}]
[]
[null,"Risiko-Arten",null,"Quelle","Maximaler Verlust (in CHF)","Eintretens-wahrscheinlichkeit"," Erwarteter Verlust (in CHF)","Ws in %"]
[null,"Wirtschaftliche Risiken","Währungsverluste","www.eulerhermes-aktuell.de/de/laenderinformationen/laenderinformationen.html",0,"Unwahrscheinlich",{"$f":"E13*H13","v":0},{"$f":"IF(F13=Unwahrscheinlich,$C$69,(IF(F13=STEW,$C$70,IF(F13=TEW,$C$71,IF(F13=MEW,$C$72,IF(F13=HEW,$C$73,IF(F13=SHEW,$C$74)))))))","v":{"v":0,"d":"0%"}}]
[null,null,"Inflation","http://data.worldbank.org/indicator/NY.GDP.DEFL.KD.ZG",0,"Unwahrscheinlich",0,{"v":0,"d":"0%"}]
[null,null,"Rezession","http://data.worldbank.org/indicator/NY.GDP.MKTP.KD.ZG",0,"Unwahrscheinlich",0,{"v":0,"d":"0%"}]
[null,null,"Devisenknappheit",null,0,"Unwahrscheinlich",0,{"v":0,"d":"0%"}]
[null,null,"Behinderung Devisentransfer","www.heritage.org/index/heatmap",0,"Unwahrscheinlich",0,{"v":0,"d":"0%"}]
[null,null,"Blockierung Mehrwertsteuer",null,0,"Unwahrscheinlich",0,{"v":0,"d":"0%"}]
[null,null,"Steuererhöhungen","www.doingbusiness.org/data/exploretopics/paying-taxes",0,"Unwahrscheinlich",0,{"v":0,"d":"0%"}]
[null,null,"Zollerhöhungen","www.wto.org/english/res_e/statis_e/statis_bis_e.htm?solution=WTO&path=/Dashboards/MAPS&file=Tariff.wcdf&bookmarkState={%22impl%22:%22client%22,%22params%22:{%22langParam%22:%22en%22}}",0,"Unwahrscheinlich",0,{"v":0,"d":"0%"}]
{"$rows_left_out":55}
{"sheet":"New","index":7,"n_rows":74,"n_cols":8,"rows_kept":74,"merged":[[5,5,5,6],[6,5,6,6],[7,5,7,6],[8,5,8,6],[9,5,9,6],[12,1,19,1],[20,1,23,1],[24,1,27,1],[28,1,30,1],[31,1,35,1],[36,1,40,1],[41,1,46,1],[47,1,49,1],[50,1,55,1],[56,1,65,1]]}
[]
[]
[]
[null,"Assessment of Export Business"]
[]
[null,"Name",null,null,"Expected export revenue (in CHF)"]
[null,"Designation",null,null,"Expected marginal income (in CHF)"]
[null,"Product",null,null,"Extraordinary income/expenses (+/- in CHF)"]
[null,"Client",null,null,"Client\n",{"$f":"SUM(F7:F8)","v":{"v":0,"d":"0.00"}}]
[null,"Country",null,null,"\nTotal expected losses (in CHF)",{"$f":"SUM(G13:G66)","v":{"v":0,"d":"0.00"}}]
[]
[null,"Risk types",null,"Source","Maximum loss (in CHF)","Probability of occurrence","Expected loss (in CHF)","Ws in%"]
[null,"Commerical risks","Currency losses","www.eulerhermes-aktuell.de/de/laenderinformationen/laenderinformationen.html",0,"Unlikely",{"$f":"E13*H13","v":0},{"$f":"IF(F13=Unwahrscheinlich,$C$69,(IF(F13=STEW,$C$70,IF(F13=TEW,$C$71,IF(F13=MEW,$C$72,IF(F13=HEW,$C$73,IF(F13=SHEW,$C$74)))))))","v":false}]
[null,null,"Inflation","http://data.worldbank.org/indicator/NY.GDP.DEFL.KD.ZG",0,"Unlikely",0,false]
[null,null,"Recession","http://data.worldbank.org/indicator/NY.GDP.MKTP.KD.ZG",0,"Unlikely",0,false]
[null,null,"Currency shortage",null,0,"Unlikely",0,false]
[null,null,"Obstacles in currency exchange","www.heritage.org/index/heatmap",0,"Unlikely",0,false]
[null,null,"Blocking of VAT",null,0,"Unlikely",0,false]
[null,null,"Tax increases","www.doingbusiness.org/data/exploretopics/paying-taxes",0,"Unlikely",0,false]
[null,null,"Zollerhöhungen","www.wto.org/english/res_e/statis_e/statis_bis_e.htm?solution=WTO&path=/Dashboards/MAPS&file=Tariff.wcdf&bookmarkState={%22impl%22:%22client%22,%22params%22:{%22langParam%22:%22en%22}}",0,"Unlikely",0,false]
{"$rows_left_out":55}
{"sheet":"Neu3","index":8,"n_rows":74,"n_cols":8,"rows_kept":74,"hidden":true,"merged":[[5,5,5,6],[6,5,6,6],[7,5,7,6],[8,5,8,6],[9,5,9,6],[12,1,19,1],[20,1,23,1],[24,1,27,1],[28,1,30,1],[31,1,35,1],[36,1,40,1],[41,1,46,1],[47,1,49,1],[50,1,55,1],[56,1,65,1]]}
[]
[]
[]
[null,"Beurteilung Exportgeschäft"]
[]
[null,"Name",null,null,"Erwarteter Exportumsatz \n(in CHF)"]
[null,"Kurzbezeichung",null,null,"Erwarteter Deckungsbeitrag \n(in CHF)"]
[null,"Produkt",null,null,"Ausserordentliche Erträge/Kosten \n(+/- in CHF)"]
[null,"Kunde",null,null,"\nTotal erwartete Gewinne (in CHF)\n",{"$f":"SUM(F7:F8)","v":{"v":0,"d":"0.00"}}]
[null,"Land",null,null,"\nTotal erwartete Verluste (in CHF)\n",{"$f":"SUM(G13:G66)","v":{"v":0,"d":"0.00"}}]
[]
[null,"Risiko-Arten",null,"Quelle","Maximaler Verlust (in CHF)","Eintretens-wahrscheinlichkeit"," Erwarteter Verlust (in CHF)","Ws in %"]
[null,"Wirtschaftliche Risiken","Währungsverluste","www.eulerhermes-aktuell.de/de/laenderinformationen/laenderinformationen.html",0,"Unwahrscheinlich",{"$f":"E13*H13","v":0},{"$f":"IF(F13=Unwahrscheinlich,$C$69,(IF(F13=STEW,$C$70,IF(F13=TEW,$C$71,IF(F13=MEW,$C$72,IF(F13=HEW,$C$73,IF(F13=SHEW,$C$74)))))))","v":{"v":0,"d":"0%"}}]
[null,null,"Inflation","http://data.worldbank.org/indicator/NY.GDP.DEFL.KD.ZG",0,"Unwahrscheinlich",0,{"v":0,"d":"0%"}]
[null,null,"Rezession","http://data.worldbank.org/indicator/NY.GDP.MKTP.KD.ZG",0,"Unwahrscheinlich",0,{"v":0,"d":"0%"}]
[null,null,"Devisenknappheit",null,0,"Unwahrscheinlich",0,{"v":0,"d":"0%"}]
[null,null,"Behinderung Devisentransfer","www.heritage.org/index/heatmap",0,"Unwahrscheinlich",0,{"v":0,"d":"0%"}]
[null,null,"Blockierung Mehrwertsteuer",null,0,"Unwahrscheinlich",0,{"v":0,"d":"0%"}]
[null,null,"Steuererhöhungen","www.doingbusiness.org/data/exploretopics/paying-taxes",0,"Unwahrscheinlich",0,{"v":0,"d":"0%"}]
[null,null,"Zollerhöhungen","www.wto.org/english/res_e/statis_e/statis_bis_e.htm?solution=WTO&path=/Dashboards/MAPS&file=Tariff.wcdf&bookmarkState={%22impl%22:%22client%22,%22params%22:{%22langParam%22:%22en%22}}",0,"Unwahrscheinlich",0,{"v":0,"d":"0%"}]
{"$rows_left_out":54}